Windows 10: Garmin BaseCamp.exe cpp_exception error code e06d7363


  1. Posts : 4
    Windows 10 Professional Version 1709 OS Build 16299.192
       14 Jan 2018 #1

    Garmin BaseCamp.exe cpp_exception error code e06d7363


    Code:
    Microsoft (R) Windows Debugger Version 10.0.17061.1000 X86
    Copyright (c) Microsoft Corporation. All rights reserved.
    
    
    Loading Dump File [C:\Users\mtdew\AppData\Local\CrashDumps\BaseCamp.exe.52000.dmp]
    User Mini Dump File: Only registers, stack and portions of memory are available
    
    Symbol search path is: srv*
    Executable search path is: 
    Windows 10 Version 16299 MP (8 procs) Free x86 compatible
    Product: WinNt, suite: SingleUserTS
    16299.15.x86fre.rs3_release.170928-1534
    Machine Name:
    Debug session time: Sat Jan  6 22:17:33.000 2018 (UTC - 7:00)
    System Uptime: not available
    Process Uptime: 0 days 0:12:18.000
    ................................................................
    ................................................................
    ................................................................
    .............
    Loading unloaded module list
    .........................
    This dump file has an exception of interest stored in it.
    The stored exception information can be accessed via .ecxr.
    (cb20.c26c): C++ EH exception - code e06d7363 (first/second chance not available)
    eax=00000000 ebx=00000000 ecx=00000000 edx=00000000 esi=00000003 edi=00000003
    eip=7745ed3c esp=1eb2d6d8 ebp=1eb2d868 iopl=0         nv up ei pl nz na pe nc
    cs=0023  ss=002b  ds=002b  es=002b  fs=0053  gs=002b             efl=00000206
    ntdll!NtWaitForMultipleObjects+0xc:
    7745ed3c c21400          ret     14h
    
    ************* Path validation summary **************
    Response                         Time (ms)     Location
    Deferred                                       SRV*c:\websymbols*http://msdl.microsoft.com/download/symbols
    0:027> !analyze -v
    *******************************************************************************
    *                                                                             *
    *                        Exception Analysis                                   *
    *                                                                             *
    *******************************************************************************
    
    *** ERROR: Module load completed but symbols could not be loaded for mscorlib.ni.dll
    *** ERROR: Module load completed but symbols could not be loaded for AppLifeCycle.dll
    *** WARNING: Unable to verify checksum for System.Drawing.ni.dll
    *** ERROR: Module load completed but symbols could not be loaded for System.Drawing.ni.dll
    *** ERROR: Symbol file could not be found.  Defaulted to export symbols for nvoglv32.dll - 
    *** ERROR: Symbol file could not be found.  Defaulted to export symbols for nvd3dum.dll - 
    *** ERROR: Symbol file could not be found.  Defaulted to export symbols for FileSyncShell.dll - 
    GetUrlPageData2 (WinHttp) failed: 12002.
    
    KEY_VALUES_STRING: 1
    
    
    TIMELINE_ANALYSIS: 1
    
    Timeline: !analyze.Start
        Name: <blank>
        Time: 2018-01-14T15:10:45.44Z
        Diff: 640392044 mSec
    
    Timeline: Dump.Current
        Name: <blank>
        Time: 2018-01-07T05:17:33.0Z
        Diff: 0 mSec
    
    Timeline: Process.Start
        Name: <blank>
        Time: 2018-01-07T05:05:15.0Z
        Diff: 738000 mSec
    
    
    DUMP_CLASS: 2
    
    DUMP_QUALIFIER: 400
    
    CONTEXT:  (.ecxr)
    eax=1eb2e0d8 ebx=1eb2e2f4 ecx=00000003 edx=00000000 esi=030c4fc4 edi=1eb2e224
    eip=748e08b2 esp=1eb2e0d8 ebp=1eb2e130 iopl=0         nv up ei pl nz ac pe nc
    cs=0023  ss=002b  ds=002b  es=002b  fs=0053  gs=002b             efl=00000216
    KERNELBASE!RaiseException+0x62:
    748e08b2 8b4c2454        mov     ecx,dword ptr [esp+54h] ss:002b:1eb2e12c=1b3dda3d
    Resetting default scope
    
    FAULTING_IP: 
    KERNELBASE!RaiseException+62
    748e08b2 8b4c2454        mov     ecx,dword ptr [esp+54h]
    
    EXCEPTION_RECORD:  (.exr -1)
    ExceptionAddress: 748e08b2 (KERNELBASE!RaiseException+0x00000062)
       ExceptionCode: e06d7363 (C++ EH exception)
      ExceptionFlags: 00000001
    NumberParameters: 3
       Parameter[0]: 19930520
       Parameter[1]: 1eb2e224
       Parameter[2]: 030c4fc4
    
    BUGCHECK_STR:  CPP_EXCEPTION
    
    DEFAULT_BUCKET_ID:  CPP_EXCEPTION
    
    PROCESS_NAME:  BaseCamp.exe
    
    ERROR_CODE: (NTSTATUS) 0xe06d7363 - <Unable to get error code text>
    
    EXCEPTION_CODE: (NTSTATUS) 0xe06d7363 - <Unable to get error code text>
    
    EXCEPTION_CODE_STR:  e06d7363
    
    EXCEPTION_PARAMETER1:  19930520
    
    EXCEPTION_PARAMETER2:  1eb2e224
    
    EXCEPTION_PARAMETER3:  030c4fc4
    
    WATSON_BKT_PROCSTAMP:  56be57c5
    
    WATSON_BKT_PROCVER:  4.6.2.0
    
    PROCESS_VER_PRODUCT:  BaseCamp
    
    WATSON_BKT_MODULE:  KERNELBASE.dll
    
    WATSON_BKT_MODSTAMP:  2cd1ce3d
    
    WATSON_BKT_MODOFFSET:  1008b2
    
    WATSON_BKT_MODVER:  10.0.16299.15
    
    MODULE_VER_PRODUCT:  Microsoft® Windows® Operating System
    
    BUILD_VERSION_STRING:  10.0.16299.64 (WinBuild.160101.0800)
    
    MODLIST_WITH_TSCHKSUM_HASH:  d4874ba22a8ba7c617332463080e4312fa70aa70
    
    MODLIST_SHA1_HASH:  4694c5b986a5dc16ae203644a7a2de821f1d0cc7
    
    NTGLOBALFLAG:  0
    
    PROCESS_BAM_CURRENT_THROTTLED: 0
    
    PROCESS_BAM_PREVIOUS_THROTTLED: 0
    
    APPLICATION_VERIFIER_FLAGS:  0
    
    DUMP_FLAGS:  94
    
    DUMP_TYPE:  1
    
    MISSING_CLR_SYMBOL: 0
    
    ANALYSIS_SESSION_HOST:  XPS-8910
    
    ANALYSIS_SESSION_TIME:  01-14-2018 08:10:45.0044
    
    ANALYSIS_VERSION: 10.0.17061.1000 x86fre
    
    MANAGED_CODE: 1
    
    MANAGED_ENGINE_MODULE:  clr
    
    MANAGED_ANALYSIS_PROVIDER:  SOS
    
    THREAD_ATTRIBUTES: 
    OS_LOCALE:  ENU
    
    PROBLEM_CLASSES: 
    
        ID:     [0n316]
        Type:   [@APPLICATION_FAULT_STRING]
        Class:  Primary
        Scope:  DEFAULT_BUCKET_ID (Failure Bucket ID prefix)
                BUCKET_ID
        Name:   Omit
        Data:   Add
                String: [CPP_EXCEPTION]
        PID:    [Unspecified]
        TID:    [Unspecified]
        Frame:  [0]
    
    PRIMARY_PROBLEM_CLASS:  CPP_EXCEPTION
    
    LAST_CONTROL_TRANSFER:  from 73559339 to 748e08b2
    
    STACK_TEXT:  
    1eb2e130 73559339 e06d7363 00000001 00000003 KERNELBASE!RaiseException+0x62
    1eb2e170 01c17e2f 1eb2e224 030c4fc4 21c77a58 msvcr120!_CxxThrowException+0x5b
    WARNING: Stack unwind information not available. Following frames may be wrong.
    1eb2e2bc 01c181bd 1eb2e2f4 1eb2fb10 1eb2e2e0 BaseCamp+0xa17e2f
    1eb2e2cc 01c15078 1eb2e2f4 1eb2f69c 1eb2e5f8 BaseCamp+0xa181bd
    1eb2e2e0 01766da8 1eb2e300 1eb2e2f4 21c77bf4 BaseCamp+0xa15078
    1eb2e310 01b9271a 735597f2 1eb2f69c 1eb2e5f8 BaseCamp+0x566da8
    1eb2f6a8 01b9539d 1eb2f6c4 1eb2f6d4 21c76e00 BaseCamp+0x99271a
    1eb2f6e4 01b951bd 24f84c60 21c76f40 774313ee BaseCamp+0x99539d
    1eb2f7a4 01c1468f 1eb2f7d0 24f84c60 21c761cc BaseCamp+0x9951bd
    1eb2f928 01c16d1d 24f84c60 21c761bc 00000000 BaseCamp+0xa1468f
    1eb2f958 771cdf76 00000000 00000001 1eb2fa3c BaseCamp+0xa16d1d
    1eb2f98c 771cfb88 00030000 00000001 1eb2fa3c user32!DispatchHookW+0xd6
    1eb2f9d8 771887bb 1eb2fa58 77188740 01b927a0 user32!CallHookWithSEH+0x2a
    1eb2fa10 77460bcd 1eb2fa2c 00000030 1eb2fae4 user32!__fnHkINLPMSG+0x7b
    1eb2fa58 7718b274 1eb2fa8c 00000000 00008008 ntdll!KiUserCallbackDispatcher+0x4d
    1eb2fa74 01c14be5 1eb2fa8c 00000000 00008008 user32!GetMessageW+0x34
    1eb2faa8 01c133df 21c76214 01b927a0 116d8b50 BaseCamp+0xa14be5
    1eb2faf0 01b92885 21c763a8 11953d58 116d8b50 BaseCamp+0xa133df
    1eb2fb4c 01c14df9 11953d58 21c764c8 7356bfb4 BaseCamp+0x992885
    1eb2fc2c 7356c01d 11953d58 45fbb477 7356bfb4 BaseCamp+0xa14df9
    1eb2fc64 7356c001 7356bfb4 1eb2fc84 745d8654 msvcr120!_callthreadstartex+0x1b
    1eb2fc70 745d8654 114639c8 745d8630 3e6223b5 msvcr120!_threadstartex+0x7c
    1eb2fc84 77454a77 114639c8 959e9784 00000000 kernel32!BaseThreadInitThunk+0x24
    1eb2fccc 77454a47 ffffffff 77479ee5 00000000 ntdll!__RtlUserThreadStart+0x2f
    1eb2fcdc 00000000 7356bfb4 114639c8 00000000 ntdll!_RtlUserThreadStart+0x1b
    
    
    THREAD_SHA1_HASH_MOD_FUNC:  26596c5a909138f9e5b352f8fe0a56ff6910be48
    
    THREAD_SHA1_HASH_MOD_FUNC_OFFSET:  e4cd1cf422d46cdc46882192592041a666edbf63
    
    THREAD_SHA1_HASH_MOD:  2ba15fdeea89f25f009885d7e48a879b14f671dc
    
    FOLLOWUP_IP: 
    BaseCamp+a17e2f
    01c17e2f 8b4df4          mov     ecx,dword ptr [ebp-0Ch]
    
    FAULT_INSTR_CODE:  64f44d8b
    
    SYMBOL_STACK_INDEX:  2
    
    SYMBOL_NAME:  basecamp+a17e2f
    
    FOLLOWUP_NAME:  MachineOwner
    
    MODULE_NAME: BaseCamp
    
    IMAGE_NAME:  BaseCamp.exe
    
    DEBUG_FLR_IMAGE_TIMESTAMP:  56be57c5
    
    STACK_COMMAND:  ~27s ; .ecxr ; kb
    
    BUCKET_ID:  CPP_EXCEPTION_basecamp+a17e2f
    
    FAILURE_EXCEPTION_CODE:  e06d7363
    
    FAILURE_IMAGE_NAME:  BaseCamp.exe
    
    BUCKET_ID_IMAGE_STR:  BaseCamp.exe
    
    FAILURE_MODULE_NAME:  BaseCamp
    
    BUCKET_ID_MODULE_STR:  BaseCamp
    
    FAILURE_FUNCTION_NAME:  Unknown
    
    BUCKET_ID_FUNCTION_STR:  Unknown
    
    BUCKET_ID_OFFSET:  a17e2f
    
    BUCKET_ID_MODTIMEDATESTAMP:  56be57c5
    
    BUCKET_ID_MODCHECKSUM:  20f6bf8
    
    BUCKET_ID_MODVER_STR:  4.6.2.0
    
    BUCKET_ID_PREFIX_STR:  CPP_EXCEPTION_
    
    FAILURE_PROBLEM_CLASS:  CPP_EXCEPTION
    
    FAILURE_SYMBOL_NAME:  BaseCamp.exe!Unknown
    
    FAILURE_BUCKET_ID:  CPP_EXCEPTION_e06d7363_BaseCamp.exe!Unknown
    
    WATSON_STAGEONE_URL:  http://watson.microsoft.com/StageOne...htm?Retriage=1
    
    TARGET_TIME:  2018-01-07T05:17:33.000Z
    
    OSBUILD:  16299
    
    OSSERVICEPACK:  15
    
    SERVICEPACK_NUMBER: 0
    
    OS_REVISION: 0
    
    SUITE_MASK:  256
    
    PRODUCT_TYPE:  1
    
    OSPLATFORM_TYPE:  x86
    
    OSNAME:  Windows 10
    
    OSEDITION:  Windows 10 WinNt SingleUserTS
    
    USER_LCID:  0
    
    OSBUILD_TIMESTAMP:  2031-10-26 20:56:14
    
    BUILDDATESTAMP_STR:  160101.0800
    
    BUILDLAB_STR:  WinBuild
    
    BUILDOSVER_STR:  10.0.16299.64
    
    ANALYSIS_SESSION_ELAPSED_TIME:  10376
    
    ANALYSIS_SOURCE:  UM
    
    FAILURE_ID_HASH_STRING:  um:cpp_exception_e06d7363_basecamp.exe!unknown
    
    FAILURE_ID_HASH:  {e8724f7f-7e5f-b8eb-4ee4-d8fc434fa17a}
    
    Followup:     MachineOwner
    ---------
    
    0:027> !thread
    No export thread found
    Garmin BaseCamp.exe cpp_exception error code e06d7363 Attached Files
    Last edited by bostonmc; 14 Jan 2018 at 10:32. Reason: Add DM_analysis file
      My ComputerSystem Spec


 

Related Threads
Not detected by USB port - Garmin in Drivers and Hardware
Hello I have a Garmin Forerunner 210 which has been driving me insane. It used to work fine and sync perfectly in the start, however it doesnt anymore. I am using the Garmin Express program to sync as it is supposted to. However, it cannot...
Hello all, I have an issue with my WIndows Updates, I am getting error code 0x80040154 and all the sites I checked did not help. Here is my Windows Update log: Got 9482F4B4-E343-43B6-B170-9A65BC822C77 redir SecondaryServiceAuth URL:...
anyone run this one before? I am not currently using a WIFI device. Error 16393 Log Name: System Source: Microsoft-Windows-Bits-Client Date: 12/8/2015 3:05:05 PM Event ID: 16393 Task Category: None Level: ...
During Windows backup, which wants to backup the 'C' drive and my games drive 'E' (for some reason), I get the following error message after the 'C' backup has completed but not the 'E': 'The backup operation that started at...
I am on my 4th SSD in my Windows 10 laptop that has been getting SMART error 2000-0151. We have replaced the motherboard, the SSD, and the connector cable between the SSD and motherboard. One thing is that I've been using Macrium Reflect to clone...
Our Sites
Site Links
About Us
Windows 10 Forums is an independent web site and has not been authorized, sponsored, or otherwise approved by Microsoft Corporation. "Windows 10" and related materials are trademarks of Microsoft Corp.

© Designer Media Ltd
All times are GMT -5. The time now is 14:49.
Find Us